{"text_format":"3","workbook":"xlsx","n_sheets":6,"sheets":["NTS","Purpose of the project","Expected harms","Fate of animals kept alive","Translations","Configuration"],"not_rendered":{"defined_names":145},"read":"whole","date_system":"1900"}

{"sheet":"NTS","index":0,"n_rows":60,"n_cols":9,"rows_kept":60,"merged":[[0,2,0,5],[1,4,3,5],[4,3,4,5],[5,3,5,4],[6,3,6,5],[7,4,7,5],[8,2,8,5],[9,3,9,5],[10,3,10,5],[11,3,11,5],[12,3,12,5],[13,3,13,5],[14,2,14,5],[15,2,15,6],[16,2,16,5],[17,2,17,5],[18,2,18,5],[19,2,19,5],[20,2,20,6],[21,2,21,5],[22,2,22,5],[23,2,23,5],[24,2,24,5],[25,2,25,5],[26,2,26,5],[27,2,27,5],[28,2,28,5],[29,2,29,6],[30,2,30,5],[31,2,31,5],[32,2,32,5],[33,2,33,5],[34,2,34,5],[35,2,35,5],[36,2,36,5],[37,2,37,5],[38,2,38,5],[39,4,39,5],[40,4,40,5],[41,2,41,3],[41,4,41,5],[42,3,42,4],[43,3,43,4],[44,3,44,4],[45,2,45,5],[46,2,46,5],[47,2,47,5],[48,3,48,5],[49,3,49,5],[50,3,50,5],[51,3,51,5],[52,3,52,5],[53,4,53,5],[54,4,54,5],[55,4,55,5],[56,4,56,5],[57,4,57,5],[58,4,58,5],[59,3,59,5]]}
["<to be hidden>","<to be hidden>",{"$f":"UPPER(NTS_title)","v":"NIETECHNICZNE STRESZCZENIE PROJEKTU"},{"$nulls":3}," "]
["xs:country",{"$f":"IF(TRIM(D2)=\"\",\"\",UPPER(D2))","v":""},{"$f":"country_label","v":"Państwo"},{"$nulls":3},"*",null,{"$f":"compulsory_field_tinstr&\" \"","v":"Obowiązkowe! "}]
["xs:language",{"$f":"IF(TRIM(D3)=\"\",\"\",LOWER(D3))","v":"pl"},{"$f":"language_label","v":"Język"},"pl",null,null,"*",null,{"$f":"compulsory_field_tinstr&\" \"","v":"Obowiązkowe! "}]
["xs:euSubmission",{"$f":"IF(TRIM(D4)=\"\",\"\",VALUE(MID(D4,SEARCH(\"[\", D4)+1,SEARCH(\"]\",D4)-SEARCH(\"[\",D4)-1)))","v":""},{"$f":"euSubmission_label","v":"Składany na poziomie UE"},{"$nulls":3},"*",null,{"$f":"compulsory_field_tinstr&\" \"&\" \"&not_published_instr&\" \"&euSubmission_instr","v":"Obowiązkowe!  Pole nie zostanie opublikowane. Proszę wskazać, czy projekt wchodzi w zakres dyrektywy, czy nie."}]
["xs:projectTitle",{"$f":"IF(TRIM(D5)=\"\",\"\",D5)","v":""},{"$f":"projectTitle_label","v":"Tytuł projektu"},{"$nulls":3},"*",null,{"$f":"compulsory_field_tinstr&\" \"&maxLength_500_tinstr","v":"Obowiązkowe! Maksymalna długość wynosi 500 znaków."}]
["xs:ntsId",{"$f":"IF(TRIM(D6)=\"\",\"\",D6)","v":""},{"$f":"ntsId_label","v":"Identyfikator SND"},{"$nulls":5},{"$f":"ntsId_instr&\" \"&ntsId_tinstr","v":"Niepowtarzalny identyfikator SND przypisany przez centralny system KE. Wypełnić tylko w przypadku aktualizacji SND już przechowywanego w systemie KE."}]
["xs:ntsNationalId",{"$f":"IF(TRIM(D7)=\"\",\"\",D7)","v":""},{"$f":"ntsNationalId_label","v":"Identyfikator krajowy SND"},{"$nulls":5},{"$f":"not_published_instr&\" \"&ntsNationalId_instr&\" \"&maxLength_500_tinstr","v":"Pole nie zostanie opublikowane. Krajowy identyfikator SND. Maksymalna długość wynosi 500 znaków."}]
["xs:projectDuration",{"$f":"IF(TRIM(D8)=\"\",\"\",D8)","v":""},{"$f":"projectDuration_label","v":"Czas trwania projektu"},null,{"$f":"duration_unit_label","v":"(w miesiącach)"},null,"*",null,{"$f":"compulsory_field_tinstr&\" \"&projectDuration_instr&\" \"&projectDuration_tinstr","v":"Obowiązkowe! Czas trwania projektu wyrażony w miesiącach. Musi być liczbą całkowitą od 1 do 60!"}]
["xs:keywords","xs:keyword",{"$f":"keywords_label","v":"Słowa kluczowe"},{"$nulls":3},"*",null,{"$f":"compulsory_field_tinstr&\" \"&at_least_one_keyword_mssg","v":"Obowiązkowe! Należy wprowadzić co najmniej jedno słowo kluczowe!"}]
[null,{"$f":"IF(TRIM(D10)=\"\",\"\",D10)","v":""},{"$f":"keyword_label & \" \" & 1","v":"Słowo kluczowe 1"},{"$nulls":5},{"$f":"maxLength_50_tinstr&\" \"&keyword_tinstr","v":"Maksymalna długość wynosi 50 znaków, w tym spacje. Może składać się z więcej niż jednego słowa."}]
{"$rows_left_out":51}
{"sheet":"Purpose of the project","index":1,"n_rows":2,"n_cols":1,"rows_kept":2}
[{"$f":"projectPurposes_label","v":"Cel(e) projektu"}]
["Purpose"]

{"sheet":"Expected harms","index":2,"n_rows":42,"n_cols":8,"rows_kept":42,"merged":[[0,1,0,4]]}
[{"$f":"expectedHarms_label","v":"Spodziewane szkody"},{"$f":"numbers_per_severity_label","v":"Szacunkowa liczba dla każdej kategorii dotkliwości"}]
[{"$f":"species_label","v":"Gatunek"},{"$f":"nonRecovery_label","v":"Terminalne"},{"$f":"mild_label","v":"Łagodne"},{"$f":"moderate_label","v":"Umiarkowane"},{"$f":"severe_label","v":"Dotkliwe"},{"$f":"custom_severity_label","v":"Stopnie dotkliwości właściwe dla danego państwa członkowskiego"}]
["xs:species","xs:nonRecovery","xs:mild","xs:moderate","xs:severe","xs:custom"]
[{"$nulls":6},{"$f":"IF(AND(expected_severities[[#This Row],[xs:species]]<>\"\",SUM(expected_severities[[#This Row],[xs:nonRecovery]:[xs:custom]])=0),total_number_mssg,IF(AND(expected_severities[[#This Row],[xs:species]]=\"\",SUM(expected_severities[[#This Row],[xs:nonRecovery]:[xs:custom]])>0),select_species_mssg,\"\"))","v":""},{"$f":"IF(AND(expected_severities[[#This Row],[xs:species]]<>\"\",OR(expected_severities[[#This Row],[xs:nonRecovery]]=\"\",expected_severities[[#This Row],[xs:mild]]=\"\",expected_severities[[#This Row],[xs:moderate]]=\"\",expected_severities[[#This Row],[xs:severe]]=\"\")),fill_all_cells_mssg,\"\")","v":""}]
[{"$nulls":6},{"$f":"IF(AND(expected_severities[[#This Row],[xs:species]]<>\"\",SUM(expected_severities[[#This Row],[xs:nonRecovery]:[xs:custom]])=0),total_number_mssg,IF(AND(expected_severities[[#This Row],[xs:species]]=\"\",SUM(expected_severities[[#This Row],[xs:nonRecovery]:[xs:custom]])>0),select_species_mssg,\"\"))","v":""},{"$f":"IF(AND(expected_severities[[#This Row],[xs:species]]<>\"\",OR(expected_severities[[#This Row],[xs:nonRecovery]]=\"\",expected_severities[[#This Row],[xs:mild]]=\"\",expected_severities[[#This Row],[xs:moderate]]=\"\",expected_severities[[#This Row],[xs:severe]]=\"\")),fill_all_cells_mssg,\"\")","v":""}]
[{"$nulls":6},{"$f":"IF(AND(expected_severities[[#This Row],[xs:species]]<>\"\",SUM(expected_severities[[#This Row],[xs:nonRecovery]:[xs:custom]])=0),total_number_mssg,IF(AND(expected_severities[[#This Row],[xs:species]]=\"\",SUM(expected_severities[[#This Row],[xs:nonRecovery]:[xs:custom]])>0),select_species_mssg,\"\"))","v":""},{"$f":"IF(AND(expected_severities[[#This Row],[xs:species]]<>\"\",OR(expected_severities[[#This Row],[xs:nonRecovery]]=\"\",expected_severities[[#This Row],[xs:mild]]=\"\",expected_severities[[#This Row],[xs:moderate]]=\"\",expected_severities[[#This Row],[xs:severe]]=\"\")),fill_all_cells_mssg,\"\")","v":""}]
[{"$nulls":6},{"$f":"IF(AND(expected_severities[[#This Row],[xs:species]]<>\"\",SUM(expected_severities[[#This Row],[xs:nonRecovery]:[xs:custom]])=0),total_number_mssg,IF(AND(expected_severities[[#This Row],[xs:species]]=\"\",SUM(expected_severities[[#This Row],[xs:nonRecovery]:[xs:custom]])>0),select_species_mssg,\"\"))","v":""},{"$f":"IF(AND(expected_severities[[#This Row],[xs:species]]<>\"\",OR(expected_severities[[#This Row],[xs:nonRecovery]]=\"\",expected_severities[[#This Row],[xs:mild]]=\"\",expected_severities[[#This Row],[xs:moderate]]=\"\",expected_severities[[#This Row],[xs:severe]]=\"\")),fill_all_cells_mssg,\"\")","v":""}]
[{"$nulls":6},{"$f":"IF(AND(expected_severities[[#This Row],[xs:species]]<>\"\",SUM(expected_severities[[#This Row],[xs:nonRecovery]:[xs:custom]])=0),total_number_mssg,IF(AND(expected_severities[[#This Row],[xs:species]]=\"\",SUM(expected_severities[[#This Row],[xs:nonRecovery]:[xs:custom]])>0),select_species_mssg,\"\"))","v":""},{"$f":"IF(AND(expected_severities[[#This Row],[xs:species]]<>\"\",OR(expected_severities[[#This Row],[xs:nonRecovery]]=\"\",expected_severities[[#This Row],[xs:mild]]=\"\",expected_severities[[#This Row],[xs:moderate]]=\"\",expected_severities[[#This Row],[xs:severe]]=\"\")),fill_all_cells_mssg,\"\")","v":""}]
[{"$nulls":6},{"$f":"IF(AND(expected_severities[[#This Row],[xs:species]]<>\"\",SUM(expected_severities[[#This Row],[xs:nonRecovery]:[xs:custom]])=0),total_number_mssg,IF(AND(expected_severities[[#This Row],[xs:species]]=\"\",SUM(expected_severities[[#This Row],[xs:nonRecovery]:[xs:custom]])>0),select_species_mssg,\"\"))","v":""},{"$f":"IF(AND(expected_severities[[#This Row],[xs:species]]<>\"\",OR(expected_severities[[#This Row],[xs:nonRecovery]]=\"\",expected_severities[[#This Row],[xs:mild]]=\"\",expected_severities[[#This Row],[xs:moderate]]=\"\",expected_severities[[#This Row],[xs:severe]]=\"\")),fill_all_cells_mssg,\"\")","v":""}]
[{"$nulls":6},{"$f":"IF(AND(expected_severities[[#This Row],[xs:species]]<>\"\",SUM(expected_severities[[#This Row],[xs:nonRecovery]:[xs:custom]])=0),total_number_mssg,IF(AND(expected_severities[[#This Row],[xs:species]]=\"\",SUM(expected_severities[[#This Row],[xs:nonRecovery]:[xs:custom]])>0),select_species_mssg,\"\"))","v":""},{"$f":"IF(AND(expected_severities[[#This Row],[xs:species]]<>\"\",OR(expected_severities[[#This Row],[xs:nonRecovery]]=\"\",expected_severities[[#This Row],[xs:mild]]=\"\",expected_severities[[#This Row],[xs:moderate]]=\"\",expected_severities[[#This Row],[xs:severe]]=\"\")),fill_all_cells_mssg,\"\")","v":""}]
{"$rows_left_out":33}
{"sheet":"Fate of animals kept alive","index":3,"n_rows":42,"n_cols":6,"rows_kept":42,"merged":[[0,1,0,3]]}
[{"$f":"fateList_label","v":"Los zwierząt utrzymywanych przy życiu"},{"$f":"numbers_per_fate_label","v":"Szacunkowa liczba zwierząt przeznaczonych do ponownego wykorzystania, przywrócenia do siedliska/systemu hodowlanego lub objętych programami znajdowania nowego domu"}]
[{"$f":"species_label","v":"Gatunek"},{"$f":"reused_label","v":"Do ponownego wykorzystania"},{"$f":"returned_label","v":"Przywróconych"},{"$f":"rehomed_label","v":"Objętych programami znajdowania nowego domu"}]
["xs:species","xs:reused","xs:returned","xs:rehomed"]
[{"$nulls":4},{"$f":"IF(AND(fate_of_animals[[#This Row],[xs:species]]<>\"\",SUM(fate_of_animals[[#This Row],[xs:reused]:[xs:rehomed]])=0),total_number_mssg,IF(AND(fate_of_animals[[#This Row],[xs:species]]=\"\",SUM(fate_of_animals[[#This Row],[xs:reused]:[xs:rehomed]])>0),select_species_mssg,\"\"))","v":""},{"$f":"IF(AND(fate_of_animals[[#This Row],[xs:species]]<>\"\",OR(fate_of_animals[[#This Row],[xs:reused]]=\"\",fate_of_animals[[#This Row],[xs:returned]]=\"\",fate_of_animals[[#This Row],[xs:rehomed]]=\"\")),fill_all_cells_mssg,\"\")","v":""}]
[{"$nulls":4},{"$f":"IF(AND(fate_of_animals[[#This Row],[xs:species]]<>\"\",SUM(fate_of_animals[[#This Row],[xs:reused]:[xs:rehomed]])=0),total_number_mssg,IF(AND(fate_of_animals[[#This Row],[xs:species]]=\"\",SUM(fate_of_animals[[#This Row],[xs:reused]:[xs:rehomed]])>0),select_species_mssg,\"\"))","v":""},{"$f":"IF(AND(fate_of_animals[[#This Row],[xs:species]]<>\"\",OR(fate_of_animals[[#This Row],[xs:reused]]=\"\",fate_of_animals[[#This Row],[xs:returned]]=\"\",fate_of_animals[[#This Row],[xs:rehomed]]=\"\")),fill_all_cells_mssg,\"\")","v":""}]
[{"$nulls":4},{"$f":"IF(AND(fate_of_animals[[#This Row],[xs:species]]<>\"\",SUM(fate_of_animals[[#This Row],[xs:reused]:[xs:rehomed]])=0),total_number_mssg,IF(AND(fate_of_animals[[#This Row],[xs:species]]=\"\",SUM(fate_of_animals[[#This Row],[xs:reused]:[xs:rehomed]])>0),select_species_mssg,\"\"))","v":""},{"$f":"IF(AND(fate_of_animals[[#This Row],[xs:species]]<>\"\",OR(fate_of_animals[[#This Row],[xs:reused]]=\"\",fate_of_animals[[#This Row],[xs:returned]]=\"\",fate_of_animals[[#This Row],[xs:rehomed]]=\"\")),fill_all_cells_mssg,\"\")","v":""}]
[{"$nulls":4},{"$f":"IF(AND(fate_of_animals[[#This Row],[xs:species]]<>\"\",SUM(fate_of_animals[[#This Row],[xs:reused]:[xs:rehomed]])=0),total_number_mssg,IF(AND(fate_of_animals[[#This Row],[xs:species]]=\"\",SUM(fate_of_animals[[#This Row],[xs:reused]:[xs:rehomed]])>0),select_species_mssg,\"\"))","v":""},{"$f":"IF(AND(fate_of_animals[[#This Row],[xs:species]]<>\"\",OR(fate_of_animals[[#This Row],[xs:reused]]=\"\",fate_of_animals[[#This Row],[xs:returned]]=\"\",fate_of_animals[[#This Row],[xs:rehomed]]=\"\")),fill_all_cells_mssg,\"\")","v":""}]
[{"$nulls":4},{"$f":"IF(AND(fate_of_animals[[#This Row],[xs:species]]<>\"\",SUM(fate_of_animals[[#This Row],[xs:reused]:[xs:rehomed]])=0),total_number_mssg,IF(AND(fate_of_animals[[#This Row],[xs:species]]=\"\",SUM(fate_of_animals[[#This Row],[xs:reused]:[xs:rehomed]])>0),select_species_mssg,\"\"))","v":""},{"$f":"IF(AND(fate_of_animals[[#This Row],[xs:species]]<>\"\",OR(fate_of_animals[[#This Row],[xs:reused]]=\"\",fate_of_animals[[#This Row],[xs:returned]]=\"\",fate_of_animals[[#This Row],[xs:rehomed]]=\"\")),fill_all_cells_mssg,\"\")","v":""}]
[{"$nulls":4},{"$f":"IF(AND(fate_of_animals[[#This Row],[xs:species]]<>\"\",SUM(fate_of_animals[[#This Row],[xs:reused]:[xs:rehomed]])=0),total_number_mssg,IF(AND(fate_of_animals[[#This Row],[xs:species]]=\"\",SUM(fate_of_animals[[#This Row],[xs:reused]:[xs:rehomed]])>0),select_species_mssg,\"\"))","v":""},{"$f":"IF(AND(fate_of_animals[[#This Row],[xs:species]]<>\"\",OR(fate_of_animals[[#This Row],[xs:reused]]=\"\",fate_of_animals[[#This Row],[xs:returned]]=\"\",fate_of_animals[[#This Row],[xs:rehomed]]=\"\")),fill_all_cells_mssg,\"\")","v":""}]
[{"$nulls":4},{"$f":"IF(AND(fate_of_animals[[#This Row],[xs:species]]<>\"\",SUM(fate_of_animals[[#This Row],[xs:reused]:[xs:rehomed]])=0),total_number_mssg,IF(AND(fate_of_animals[[#This Row],[xs:species]]=\"\",SUM(fate_of_animals[[#This Row],[xs:reused]:[xs:rehomed]])>0),select_species_mssg,\"\"))","v":""},{"$f":"IF(AND(fate_of_animals[[#This Row],[xs:species]]<>\"\",OR(fate_of_animals[[#This Row],[xs:reused]]=\"\",fate_of_animals[[#This Row],[xs:returned]]=\"\",fate_of_animals[[#This Row],[xs:rehomed]]=\"\")),fill_all_cells_mssg,\"\")","v":""}]
{"$rows_left_out":33}
{"sheet":"Translations","index":4,"n_rows":225,"n_cols":29,"rows_kept":225,"hidden":true}
[]
["languages",null,null,"bg","cs","da","de","el","en","es","et","fi","fr","ga","hr","hu","it","lt","lv","mt","nl","pl","pt","ro","sk","sl","sv","no"]
[]
["purposeCategories","purposeCategoryTranslated",null,{"$f":"languages","v":"bg"},"cs","da","de","el","en","es","et","fi","fr","ga","hr","hu","it","lt","lv","mt","nl","pl","pt","ro","sk","sl","sv","no"]
["PB",{"$f":"IF(TRIM(HLOOKUP(language_or_default,purposeCategoryTranslations,MATCH(A5,purposeCategories,0),FALSE))=\"\",HLOOKUP(\"en\",purposeCategoryTranslations,MATCH(A5,purposeCategories,0),FALSE),HLOOKUP(language_or_default,purposeCategoryTranslations,MATCH(A5,purposeCategories,0),FALSE))","v":"Badania podstawowe"},null,"Фундаментални изследвания","Základní výzkum","Grundforskning","Grundlagenforschung","Βασική έρευνα","Basic research","Investigación básica","Alusuuringud","Perustutkimus","Recherche fondamentale",null,"Temeljna istraživanja","Alapkutatás","Ricerca di base","Fundamentiniai moksliniai tyrimai","Fundamentālie pētījumi","Riċerka bażika","Fundamenteel onderzoek","Badania podstawowe","Investigação fundamental","Cercetare de bază","Základný výskum","Temeljne raziskave","Grundforskning","Grunnforskning"]
["PT","Badania translacyjne i stosowane",null,"Транслационни и приложни изследвания","Translační a aplikovaný výzkum","Translationel eller anvendt forskning","Translationale und angewandte Forschung","Μεταγραφική και εφαρμοσμένη έρευνα","Translational and applied research","Investigación traslacional y aplicada","Translatiivsed ja rakendusuuringud","Translaatiotutkimus ja soveltava tutkimus","Recherche translationnelle et appliquée",null,"Translacijska i primijenjena istraživanja","Transzlációs és alkalmazott kutatás","Ricerca traslazionale e applicata","Perkėlimo ir taikomieji moksliniai tyrimai","Praktiskā izpēte un lietišķie pētījumi","Riċerka translazzjonali u applikata","Omzettinggericht en toegepast onderzoek","Badania translacyjne i stosowane","Investigação translacional ou aplicada","Cercetare translațională și aplicată","Translačný a aplikovaný výskum","Translacijske in uporabne raziskave","Translationell och tillämpad forskning","Translasjonell og anvendt forskning"]
["PR","Badania w celach regulacyjnych i produkcja rutynowa",null,"Регулаторно използване и рутинно производство","Použití pro legislativní účely a běžnou výrobu","Forskriftsmæssig anvendelse og rutineproduktion","Verwendung zu regulatorischen Zwecken und Routineproduktion","Χρήση στο πλαίσιο ρυθμίσεων και συνήθης παραγωγή","Regulatory use and routine production","Utilización reglamentaria y producción rutinaria","Õiguslike nõuete täitmisega seotud kasutus ja tavapärane tootmine","Lakisääteinen käyttö ja rutiinituotanto","Utilisation réglementaire et production de routine",null,"Regulatorno korištenje i rutinska proizvodnja","Hatósági vizsgálatok és rutinszerű gyártás","Uso a fini regolatori e produzione ordinaria","Teisės aktais grindžiamas naudojimas ir įprastinė gamyba","Izmantošana regulatīviem mērķiem un rutīnveida ražošanā","Użu regolatorju u produzzjoni ta’ rutina","Gebruik op grond van regelgeving en voor routineproductie","Badania w celach regulacyjnych i produkcja rutynowa","Utilização regulamentar e produção de rotina","Utilizare normativă și producere de rutină","Použitie na regulačné účely a bežná výroba","Predpisana uporaba in redna proizvodnja","Lagstadgad användning och rutinmässig produktion","Regelverksbasert bruk og rutineproduksjon"]
["PE40","Ochrona środowiska naturalnego w interesie zdrowia lub dobrostanu ludzi lub zwierząt",null,"Защита на естествената околна среда в интерес на здравето или благосъстоянието на хората или животните","Ochrana přírodního prostředí v zájmu zdraví nebo dobrých životních podmínek lidí nebo zvířat","Beskyttelse af miljøet af hensyn til menneskers eller dyrs sundhed eller velfærd","Schutz der natürlichen Umwelt im Interesse der Gesundheit oder des Wohlbefindens von Menschen und Tieren","Προστασία του φυσικού περιβάλλοντος με γνώμονα την υγεία ή την καλή διαβίωση ανθρώπων και ζώων","Protection of the natural environment in the interests of the health or welfare of human beings or animals","Protección del medio ambiente natural en interés de la salud o del bienestar de los seres humanos o de los animales","Loodusliku keskkonna kaitsmine inimeste või loomade tervise või heaolu huvides","Luonnonympäristön suojelu ihmisten tai eläinten terveyden tai hyvinvoinnin vuoksi","Protection de l’environnement naturel dans l’intérêt de la santé ou du bien-être de l’homme ou de l’animal",null,"Zaštita prirodnog okoliša u interesu zdravlja ili dobrobiti ljudi i životinja","A természetes környezet védelme az emberek vagy állatok egészsége vagy jólléte érdekében","Protezione dell'ambiente naturale, nell'interesse della salute o del benessere degli esseri umani o degli animali","Gamtinės aplinkos apsauga siekiant užtikrinti žmonių ar gyvūnų sveikatą ar gerovę","Dabiskās vides aizsardzība cilvēka vai dzīvnieku veselības vai labklājības interesēs","Protezzjoni tal-ambjent naturali fl-interessi tas-saħħa jew tal-benessri tal-bniedem jew tal-annimali","Bescherming van het milieu in het belang van de gezondheid of het welzijn van mens of dier","Ochrona środowiska naturalnego w interesie zdrowia lub dobrostanu ludzi lub zwierząt","Proteção do ambiente natural no interesse da saúde ou do bem-estar humanos ou dos animais","Protecția mediului natural în interesul sănătății ori al bunăstării oamenilor sau animalelor","Ochrana prirodzeného prostredia v záujme zdravia alebo dobrých životných podmienok ľudí alebo zvierat","Varstvo naravnega okolja za varovanje zdravja ali dobrobiti ljudi ali živali","Skydd av den naturliga miljön för att bevara människors eller djurs hälsa eller välfärd","Vern av naturmiljøet av hensyn til menneskers eller dyrs helse eller velferd"]
["PS41","Badania mające na celu zachowanie gatunku",null,"Опазване на видовете","Zachování druhů","Artsbevarelse","Erhaltung der Art","Διατήρηση ζωικών ειδών","Preservation of species","Preservación de especies","Liigi säilitamine","Lajien säilyttäminen","Préservation des espèces",null,"Očuvanje životinjskih vrsta","Fajok megőrzése","Conservazione delle specie","Rūšių išsaugojimas","Sugu saglabāšana","Preservazzjoni tal-ispeċijiet","Behoud van de soort","Badania mające na celu zachowanie gatunku","Preservação de espécies","Conservarea speciilor","Ochrana druhov","Ohranjanje živalskih vrst","Artskydd","Artsbevaring"]
["PE42-1","Kształcenie na poziomie szkolnictwa wyższego",null,"Висше образование","Vyšší vzdělávání","Højere uddannelse","Hochschulausbildung","Τριτοβάθμια εκπαίδευση","Higher education","Enseñanza superior","Kõrgharidus","Korkea-asteen koulutus","Enseignement supérieur",null,"Visoko obrazovanje","Felsőoktatás","Insegnamento superiore","Aukštasis mokslas","Augstākā izglītība","Edukazzjoni għolja","Hoger onderwijs","Kształcenie na poziomie szkolnictwa wyższego","Ensino superior","Învățământ superior","Vysokoškolské vzdelávanie","Visokošolsko izobraževanje","Högre utbildning","Høyere utdanning"]
{"$rows_left_out":216}
{"sheet":"Configuration","index":5,"n_rows":38,"n_cols":4,"rows_kept":38,"hidden":true}
[]
["language_or_default",{"$f":"IF(language=\"\",\"en\",language)","v":"pl"}]
["choice_mandatory",{"$f":"yes","v":"tak [1]"},{"$f":"no","v":"nie [0]"}]
["choice_optional",{"$f":"yes","v":"tak [1]"}," "]
["template_version",1]
["selection_for_RA",{"$f":"IF(NTS!B2=\"\",\"\",IF(VLOOKUP(NTS!B2,A11:B38,2)=\"yes\",\"*\",\"\"))","v":""}]
["project_start_end_date",{"$f":"IF(NTS!B2=\"\",\"\",IF(VLOOKUP(NTS!B2,A11:C38,3)=\"yes\",\"*\",\"\"))","v":""}]
["project_approval_date",{"$f":"IF(NTS!B2=\"\",\"\",IF(VLOOKUP(NTS!B2,A11:D38,4)=\"yes\",\"*\",\"\"))","v":""}]
[]
["countries","Selection for RA is applicable?","Project start/end date applicable?","Project approval date?"]
{"$rows_left_out":28}